Reaction Details
TargetC-X-C motif chemokine 10
LigandBDBM249587
Substrate/Competitorn/a
Meas. Tech.Radioligand Binding Assay
Temperature298.15±n/a K
IC50 40±n/a nM
Commentsextracted
Citation Bata, IBartane Bodor, VVasas, ABuzder-Lantos, PFerenczy, GTomoskozi, ZSzeleczky, GSzamosvolgyi, Z Substituted B-amino acid derivatives as CXCR3 receptor antagonists US Patent US9447038 Publication Date 9/20/2016
 
C-X-C motif chemokine 10
Name:C-X-C motif chemokine 10
Type:Enzyme
Mol. Mass.:10892.04
Organism:Homo sapiens (Human)
Description:P02778
Residue:98
BDBM249587
NameBDBM249587
Synonyms:US9447038, 15
TypeSmall organic molecule
Emp. Form.C26H27Cl2FN2O5
Mol. Mass.537.407
SMILESOC(=O)C[C@H](N(CC1CC1)Cc1ccc(OCCN2C(=O)CCC2=O)c(Cl)c1)c1ccc(Cl)c(F)c1