Reaction Details
TargetC-X-C motif chemokine 10
LigandBDBM249615
Substrate/Competitorn/a
Meas. Tech.Radioligand Binding Assay
Temperature298.15±n/a K
IC50 23±n/a nM
Commentsextracted
Citation Bata, IBartane Bodor, VVasas, ABuzder-Lantos, PFerenczy, GTomoskozi, ZSzeleczky, GSzamosvolgyi, Z Substituted B-amino acid derivatives as CXCR3 receptor antagonists US Patent US9447038 Publication Date 9/20/2016
 
C-X-C motif chemokine 10
Name:C-X-C motif chemokine 10
Type:Enzyme
Mol. Mass.:10892.04
Organism:Homo sapiens (Human)
Description:P02778
Residue:98
BDBM249615
NameBDBM249615
Synonyms:US9447038, 43
TypeSmall organic molecule
Emp. Form.C27H32ClFN2O6
Mol. Mass.535.004
SMILESCCCCN(Cc1ccc(OCCN2C(=O)CCC2=O)c(OC)c1)C(CC(O)=O)c1ccc(Cl)c(F)c1