Reaction Details
TargetC-X-C motif chemokine 10
LigandBDBM249643
Substrate/Competitorn/a
Meas. Tech.Radioligand Binding Assay
Temperature298.15±n/a K
IC50 54±n/a nM
Commentsextracted
Citation Bata, IBartane Bodor, VVasas, ABuzder-Lantos, PFerenczy, GTomoskozi, ZSzeleczky, GSzamosvolgyi, Z Substituted B-amino acid derivatives as CXCR3 receptor antagonists US Patent US9447038 Publication Date 9/20/2016
 
C-X-C motif chemokine 10
Name:C-X-C motif chemokine 10
Type:Enzyme
Mol. Mass.:10892.04
Organism:Homo sapiens (Human)
Description:P02778
Residue:98
BDBM249643
NameBDBM249643
Synonyms:US9447038, 71
TypeSmall organic molecule
Emp. Form.C28H33ClN2O5
Mol. Mass.513.025
SMILESCc1cc(CN(CC2CCC2)[C@@H](CC(O)=O)c2ccc(Cl)cc2)ccc1OCCN1C(=O)CCC1=O