Reaction Details
TargetC-X-C motif chemokine 10
LigandBDBM249657
Substrate/Competitorn/a
Meas. Tech.Radioligand Binding Assay
Temperature298.15±n/a K
IC50 58±n/a nM
Commentsextracted
Citation Bata, IBartane Bodor, VVasas, ABuzder-Lantos, PFerenczy, GTomoskozi, ZSzeleczky, GSzamosvolgyi, Z Substituted B-amino acid derivatives as CXCR3 receptor antagonists US Patent US9447038 Publication Date 9/20/2016
 
C-X-C motif chemokine 10
Name:C-X-C motif chemokine 10
Type:Enzyme
Mol. Mass.:10892.04
Organism:Homo sapiens (Human)
Description:P02778
Residue:98
BDBM249657
NameBDBM249657
Synonyms:US9447038, 85
TypeSmall organic molecule
Emp. Form.C27H33ClN2O5
Mol. Mass.501.014
SMILESCCCN(Cc1ccc(OCCN2C(=O)CCC2=O)c(CC)c1)C(CC(O)=O)c1ccc(Cl)cc1