Reaction Details
TargetC-X-C motif chemokine 10
LigandBDBM249719
Substrate/Competitorn/a
Meas. Tech.Radioligand Binding Assay
Temperature298.15±n/a K
IC50 46±n/a nM
Commentsextracted
Citation Bata, IBartane Bodor, VVasas, ABuzder-Lantos, PFerenczy, GTomoskozi, ZSzeleczky, GSzamosvolgyi, Z Substituted B-amino acid derivatives as CXCR3 receptor antagonists US Patent US9447038 Publication Date 9/20/2016
 
C-X-C motif chemokine 10
Name:C-X-C motif chemokine 10
Type:Enzyme
Mol. Mass.:10892.04
Organism:Homo sapiens (Human)
Description:P02778
Residue:98
BDBM249719
NameBDBM249719
Synonyms:US9447038, 147
TypeSmall organic molecule
Emp. Form.C31H38N2O6
Mol. Mass.534.6432
SMILESCc1cc(CN(CC2CCCC2)C(CC(O)=O)c2ccc3OCCc3c2)ccc1OCCN1C(=O)CCC1=O