Reaction Details
TargetC-X-C motif chemokine 10
LigandBDBM249764
Substrate/Competitorn/a
Meas. Tech.Radioligand Binding Assay
Temperature298.15±n/a K
IC50 55±n/a nM
Commentsextracted
Citation Bata, IBartane Bodor, VVasas, ABuzder-Lantos, PFerenczy, GTomoskozi, ZSzeleczky, GSzamosvolgyi, Z Substituted B-amino acid derivatives as CXCR3 receptor antagonists US Patent US9447038 Publication Date 9/20/2016
 
C-X-C motif chemokine 10
Name:C-X-C motif chemokine 10
Type:Enzyme
Mol. Mass.:10892.04
Organism:Homo sapiens (Human)
Description:P02778
Residue:98
BDBM249764
NameBDBM249764
Synonyms:US9447038, 192
TypeSmall organic molecule
Emp. Form.C26H30Cl2N2O5S
Mol. Mass.553.498
SMILESCCCN(Cc1ccc(SCCN2C(=O)CCC2=O)c(OC)c1)C(CC(O)=O)c1ccc(Cl)c(Cl)c1