Reaction Details
TargetProthrombin
LigandBDBM238254
Substrate/Competitorn/a
Meas. Tech.Factor Xa and Thrombin Enzyme Assay
IC50>100000±n/a nM
Citation Imagawa, AKondo, TNishiyama, TCourtney, SYarnold, CIchihara, OFlanagan, S Substituted pyrrolidines as factor XIa inhibitors for the treatment thromboembolic diseases US Patent US9585881 Publication Date 3/7/2017
 
Prothrombin
Name:Prothrombin
Type:Protein
Mol. Mass.:70029.57
Organism:Homo sapiens (Human)
Description:P00734
Residue:622
BDBM238254
NameBDBM238254
Synonyms:US10882855, Example 39 US9585881, Example 39
TypeSmall organic molecule
Emp. Form.C31H31ClN8O4S
Mol. Mass.647.147
SMILESClc1ccc(c(\C=C\C(=O)N2C[C@H](C[C@H]2C(=O)Nc2ccccc2)N2CCN(CC2)S(=O)(=O)c2ccccc2)c1)-n1cnnn1