Reaction Details
TargetCoagulation factor XI
LigandBDBM238260
Substrate/Competitorn/a
Meas. Tech.Factor XIa Enzyme Assay
IC50 4.40±n/a nM
Citation Imagawa, AKondo, TNishiyama, TCourtney, SYarnold, CIchihara, OFlanagan, S Substituted pyrrolidines as factor XIa inhibitors for the treatment thromboembolic diseases US Patent US9585881 Publication Date 3/7/2017
 
Coagulation factor XI
Name:Coagulation factor XI
Type:Enzyme
Mol. Mass.:70130.58
Organism:Homo sapiens (Human)
Description:P03951
Residue:625
BDBM238260
NameBDBM238260
Synonyms:US10336741, Example 73 US9394250, 73 | US9585881, Example 73
TypeSmall organic molecule
Emp. Form.C29H35N7O5S
Mol. Mass.593.697
SMILESCOC(=O)Nc1ccc(cc1)-c1cnc([nH]1)[C@@H]1C[C@@H](CN1C(=O)c1ccc(cc1)C(N)=N)C1CCN(CC1)S(C)(=O)=O