Reaction Details
TargetProthrombin
LigandBDBM294104
Substrate/Competitorn/a
Meas. Tech.Factor Xa and Thrombin Enzyme Assay
IC50>100000±n/a nM
Citation Imagawa, AKondo, TNishiyama, TCourtney, SYarnold, CIchihara, OFlanagan, S Substituted pyrrolidines as factor XIa inhibitors for the treatment thromboembolic diseases US Patent US9585881 Publication Date 3/7/2017
 
Prothrombin
Name:Prothrombin
Type:Protein
Mol. Mass.:70029.57
Organism:Homo sapiens (Human)
Description:P00734
Residue:622
BDBM294104
NameBDBM294104
Synonyms:US10336741, Example 86 US9585881, Example 86 | methyl [4-(2-{(2S,4R)-1-({trans-4-[(1S)-1-aminoethyl]cyclohexyl}carbonyl)-4-[1-(methylsulfonyl)-4-piperidinyl]-2-pyrrolidinyl}-4-chloro-1H-imidazol-5-yl)phenyl]carbamate bis(trifluoroacetate)
TypeSmall organic molecule
Emp. Form.C30H43ClN6O5S
Mol. Mass.635.218
SMILESCOC(=O)Nc1ccc(cc1)-c1[nH]c(nc1Cl)[C@@H]1C[C@@H](CN1C(=O)[C@H]1CC[C@@H](CC1)[C@H](C)N)C1CCN(CC1)S(C)(=O)=O