Reaction Details
TargetCoagulation factor XI
LigandBDBM238264
Substrate/Competitorn/a
Meas. Tech.Factor XIa Enzyme Assay
IC50 18.0±n/a nM
Citation Imagawa, AKondo, TNishiyama, TCourtney, SYarnold, CIchihara, OFlanagan, S Substituted pyrrolidines as factor XIa inhibitors for the treatment thromboembolic diseases US Patent US9585881 Publication Date 3/7/2017
 
Coagulation factor XI
Name:Coagulation factor XI
Type:Enzyme
Mol. Mass.:70130.58
Organism:Homo sapiens (Human)
Description:P03951
Residue:625
BDBM238264
NameBDBM238264
Synonyms:US10336741, Example 93 US9394250, 93 | US9585881, Example 93
TypeSmall organic molecule
Emp. Form.C28H30ClFN4O6S
Mol. Mass.605.077
SMILESCn1cc(Cl)c2c(F)c(ccc12)C(=O)N1C[C@H](C[C@H]1C(=O)Nc1ccc(cc1)C(O)=O)C1CCN(CC1)S(C)(=O)=O