Reaction Details
TargetCoagulation factor X
LigandBDBM238259
Substrate/Competitorn/a
Meas. Tech.Factor Xa and Thrombin Enzyme Assay
IC50>100000±n/a nM
Citation Imagawa, AKondo, TNishiyama, TCourtney, SYarnold, CIchihara, OFlanagan, S Substituted pyrrolidines as factor XIa inhibitors for the treatment thromboembolic diseases US Patent US9585881 Publication Date 3/7/2017
 
Coagulation factor X
Name:Coagulation factor X
Type:Enzyme
Mol. Mass.:54726.60
Organism:Homo sapiens (Human)
Description:n/a
Residue:488
BDBM238259
NameBDBM238259
Synonyms:US10336741, Example 71 US9394250, 71 | US9585881, Example 71
TypeSmall organic molecule
Emp. Form.C28H39ClN8O5S
Mol. Mass.635.178
SMILESCOC(=O)Nc1ccc(cc1)-c1[nH]c(nc1Cl)[C@@H]1C[C@@H](CN1C(=O)C1CCN(CC1)C(N)=N)C1CCN(CC1)S(C)(=O)=O