Reaction Details
TargetMelanocyte-stimulating hormone receptor
LigandBDBM250642
Substrate/Competitorn/a
Meas. Tech.Competitive Inhibition Binding Assay
pH7.5±n/a
Temperature310.15±n/a K
Ki 0.01±n/a nM
Commentsextracted
Citation Yang, WShi, Y Melanocortin-1 receptor-specific cyclic peptides US Patent US9447148 Publication Date 9/20/2016
 
Melanocyte-stimulating hormone receptor
Name:Melanocyte-stimulating hormone receptor
Type:Enzyme
Mol. Mass.:34717.23
Organism:Homo sapiens (Human)
Description:Q01726
Residue:317
BDBM250642
NameBDBM250642
Synonyms:US9447148, 9.10
TypeSmall organic molecule
Emp. Form.C51H68N14O9
Mol. Mass.1021.174
SMILESCCCC[C@H](NC(C)=O)C(=O)N[C@H]1CCC(=O)NCC[C@H](NC(=O)[C@H](CCCNC(N)=N)NC(=O)[C@@H](Cc2ccccc2)NC(=O)[C@H](Cc2c[nH]cn2)NC1=O)C(=O)N[C@@H](Cc1ccc2ccccc2c1)C(N)=O