Reaction Details
TargetMelanocyte-stimulating hormone receptor
LigandBDBM135768
Substrate/Competitorn/a
Meas. Tech.Competitive Inhibition Binding Assay
pH7.5±n/a
Temperature310.15±n/a K
Ki 0.12±n/a nM
Commentsextracted
Citation Yang, WShi, Y Melanocortin-1 receptor-specific cyclic peptides US Patent US9447148 Publication Date 9/20/2016
 
Melanocyte-stimulating hormone receptor
Name:Melanocyte-stimulating hormone receptor
Type:Enzyme
Mol. Mass.:34717.23
Organism:Homo sapiens (Human)
Description:Q01726
Residue:317
BDBM135768
NameBDBM135768
Synonyms:US10179804, Example 153 US8846601, 153 | US9458201, 153
TypeSmall organic molecule
Emp. Form.C46H62N14O8
Mol. Mass.939.0735
SMILESCCCCC(=O)N[C@H]1CCC(=O)NCC[C@H](NC(=O)[C@H](CCCNC(N)=N)NC(=O)[C@@H](Cc2ccccc2)NC(=O)[C@H](Cc2c[nH]cn2)NC1=O)C(=O)N[C@@H](Cc1c[nH]c2ccccc12)C(N)=O