Reaction Details
TargetLysophosphatidic acid receptor 5
LigandBDBM251684
Substrate/Competitorn/a
Meas. Tech.Receptor Assay
Temperature310.15±n/a K
IC50 40±n/a nM
Commentsextracted
Citation Buffham, WCanning, HDavenport, RFarnaby, WMack, SParmar, AWright, S Compounds US Patent US9464060 Publication Date 10/11/2016
 
Lysophosphatidic acid receptor 5
Name:Lysophosphatidic acid receptor 5
Type:Enzyme
Mol. Mass.:41372.36
Organism:Homo sapiens (Human)
Description:Q9H1C0
Residue:372
BDBM251684
NameBDBM251684
Synonyms:US10100018, Example 20 | US9464060, 20
TypeSmall organic molecule
Emp. Form.C30H26FNO5
Mol. Mass.499.5295
SMILESO[C@@H](CN(Cc1ccc(cc1)C(O)=O)C(=O)c1ccc(Oc2ccccc2F)cc1)Cc1ccccc1