Reaction Details
TargetLysophosphatidic acid receptor 5
LigandBDBM251696
Substrate/Competitorn/a
Meas. Tech.Receptor Assay
Temperature310.15±n/a K
IC50 0.4±n/a nM
Commentsextracted
Citation Buffham, WCanning, HDavenport, RFarnaby, WMack, SParmar, AWright, S Compounds US Patent US9464060 Publication Date 10/11/2016
 
Lysophosphatidic acid receptor 5
Name:Lysophosphatidic acid receptor 5
Type:Enzyme
Mol. Mass.:41372.36
Organism:Homo sapiens (Human)
Description:Q9H1C0
Residue:372
BDBM251696
NameBDBM251696
Synonyms:US10100018, Example 32 | US9464060, 32
TypeSmall organic molecule
Emp. Form.C31H29NO5
Mol. Mass.495.5657
SMILESCOc1ccccc1Oc1ccc(cc1)C(=O)N(CCCc1ccccc1)Cc1ccc(cc1)C(O)=O