Reaction Details
TargetLysophosphatidic acid receptor 5
LigandBDBM251729
Substrate/Competitorn/a
Meas. Tech.Receptor Assay
Temperature310.15±n/a K
IC50 4±n/a nM
Commentsextracted
Citation Buffham, WCanning, HDavenport, RFarnaby, WMack, SParmar, AWright, S Compounds US Patent US9464060 Publication Date 10/11/2016
 
Lysophosphatidic acid receptor 5
Name:Lysophosphatidic acid receptor 5
Type:Enzyme
Mol. Mass.:41372.36
Organism:Homo sapiens (Human)
Description:Q9H1C0
Residue:372
BDBM251729
NameBDBM251729
Synonyms:US10100018, Example 65 | US9464060, 65
TypeSmall organic molecule
Emp. Form.C27H29NO5
Mol. Mass.447.5229
SMILESCCCCN(Cc1ccc(cc1)C(=O)OC)C(=O)c1ccc(Oc2ccccc2OC)cc1