Reaction Details
TargetLysophosphatidic acid receptor 5
LigandBDBM251730
Substrate/Competitorn/a
Meas. Tech.Receptor Assay
Temperature310.15±n/a K
IC50 5±n/a nM
Commentsextracted
Citation Buffham, WCanning, HDavenport, RFarnaby, WMack, SParmar, AWright, S Compounds US Patent US9464060 Publication Date 10/11/2016
 
Lysophosphatidic acid receptor 5
Name:Lysophosphatidic acid receptor 5
Type:Enzyme
Mol. Mass.:41372.36
Organism:Homo sapiens (Human)
Description:Q9H1C0
Residue:372
BDBM251730
NameBDBM251730
Synonyms:US10100018, Example 66 | US9464060, 66
TypeSmall organic molecule
Emp. Form.C26H24FNO5
Mol. Mass.449.4709
SMILESCOc1ccccc1Oc1ccc(C(=O)N(CC2CC2)Cc2ccc(cc2)C(O)=O)c(F)c1