Reaction Details
TargetLysophosphatidic acid receptor 5
LigandBDBM251736
Substrate/Competitorn/a
Meas. Tech.Receptor Assay
Temperature310.15±n/a K
IC50 42±n/a nM
Commentsextracted
Citation Buffham, WCanning, HDavenport, RFarnaby, WMack, SParmar, AWright, S Compounds US Patent US9464060 Publication Date 10/11/2016
 
Lysophosphatidic acid receptor 5
Name:Lysophosphatidic acid receptor 5
Type:Enzyme
Mol. Mass.:41372.36
Organism:Homo sapiens (Human)
Description:Q9H1C0
Residue:372
BDBM251736
NameBDBM251736
Synonyms:US10100018, Example 72 | US9464060, 72
TypeSmall organic molecule
Emp. Form.C23H17ClF3NO4
Mol. Mass.463.834
SMILESOC(=O)c1ccc(CN(CC(F)(F)F)C(=O)c2ccc(Oc3ccccc3Cl)cc2)cc1