Reaction Details
TargetAcetylcholinesterase
LigandBDBM294220
Substrate/Competitorn/a
Meas. Tech.Enzyme Assay
IC50 7900±n/a nM
Citation Gulcan, HOUnlu, SEsiringu, ISahin, YErcetin, TOz, DSahin, F 1-(dimethylamino)ethyl-substituted 6H-benzo[C]chromen-6-ones against senile dementia US Patent US9586925 Publication Date 3/7/2017
 
Acetylcholinesterase
Name:Acetylcholinesterase
Type:Enzyme
Mol. Mass.:67792.70
Organism:Homo sapiens (Human)
Description:P22303
Residue:614
BDBM294220
NameBDBM294220
Synonyms:(S)-3-(1-(dimethylamino)ethyl)-6H-benzo[c]chromen-6-one US9586925, Example VI
TypeSmall organic molecule
Emp. Form.C17H17NO2
Mol. Mass.267.3224
SMILESC[C@H](N(C)C)c1ccc2c(c1)oc(=O)c1ccccc21