Reaction Details
TargetCholinesterase
LigandBDBM294223
Substrate/Competitorn/a
Meas. Tech.Enzyme Assay
IC50 4200±n/a nM
Citation Gulcan, HOUnlu, SEsiringu, ISahin, YErcetin, TOz, DSahin, F 1-(dimethylamino)ethyl-substituted 6H-benzo[C]chromen-6-ones against senile dementia US Patent US9586925 Publication Date 3/7/2017
 
Cholinesterase
Name:Cholinesterase
Type:Homotetramer
Mol. Mass.:68422.27
Organism:Homo sapiens (Human)
Description:P06276
Residue:602
BDBM294223
NameBDBM294223
Synonyms:(±)-3-(1-(dimethylamino)ethyl)-1-hydroxy-6H-benzo[c]chromen-6-one US9586925, EXAMPLE XV
TypeSmall organic molecule
Emp. Form.C17H17NO3
Mol. Mass.283.3218
SMILESCC(N(C)C)c1cc(O)c2c(c1)oc(=O)c1ccccc21