Reaction Details
TargetAcetylcholinesterase
LigandBDBM294224
Substrate/Competitorn/a
Meas. Tech.Enzyme Assay
IC50 33100±n/a nM
Citation Gulcan, HOUnlu, SEsiringu, ISahin, YErcetin, TOz, DSahin, F 1-(dimethylamino)ethyl-substituted 6H-benzo[C]chromen-6-ones against senile dementia US Patent US9586925 Publication Date 3/7/2017
 
Acetylcholinesterase
Name:Acetylcholinesterase
Type:Enzyme
Mol. Mass.:67792.70
Organism:Homo sapiens (Human)
Description:P22303
Residue:614
BDBM294224
NameBDBM294224
Synonyms:(±)-1-(1-(dimethylamino)ethyl)-3-hydroxy-6H-benzo[c]chromen-6-one US9586925, EXAMPLE XVII
TypeSmall organic molecule
Emp. Form.C17H17NO3
Mol. Mass.283.3218
SMILESCC(N(C)C)c1cc(O)cc2oc(=O)c3ccccc3c12