Reaction Details
TargetAcetylcholinesterase
LigandBDBM294226
Substrate/Competitorn/a
Meas. Tech.Enzyme Assay
IC50>40000±n/a nM
Citation Gulcan, HOUnlu, SEsiringu, ISahin, YErcetin, TOz, DSahin, F 1-(dimethylamino)ethyl-substituted 6H-benzo[C]chromen-6-ones against senile dementia US Patent US9586925 Publication Date 3/7/2017
 
Acetylcholinesterase
Name:Acetylcholinesterase
Type:Enzyme
Mol. Mass.:67792.70
Organism:Homo sapiens (Human)
Description:P22303
Residue:614
BDBM294226
NameBDBM294226
Synonyms:(±)-1-(1-(dimethylamino)ethyl)-6-oxo-6H-benzo[c]chromen-3-yl ethyl(methyl)carbamate US9586925, EXAMPLE XXI
TypeSmall organic molecule
Emp. Form.C21H24N2O4
Mol. Mass.368.4263
SMILESCCN(C)C(=O)Oc1cc(C(C)N(C)C)c2c(c1)oc(=O)c1ccccc21