Reaction Details
TargetCholinesterase
LigandBDBM294226
Substrate/Competitorn/a
Meas. Tech.Enzyme Assay
IC50 8500±n/a nM
Citation Gulcan, HOUnlu, SEsiringu, ISahin, YErcetin, TOz, DSahin, F 1-(dimethylamino)ethyl-substituted 6H-benzo[C]chromen-6-ones against senile dementia US Patent US9586925 Publication Date 3/7/2017
 
Cholinesterase
Name:Cholinesterase
Type:Homotetramer
Mol. Mass.:68422.27
Organism:Homo sapiens (Human)
Description:P06276
Residue:602
BDBM294226
NameBDBM294226
Synonyms:(±)-1-(1-(dimethylamino)ethyl)-6-oxo-6H-benzo[c]chromen-3-yl ethyl(methyl)carbamate US9586925, EXAMPLE XXI
TypeSmall organic molecule
Emp. Form.C21H24N2O4
Mol. Mass.368.4263
SMILESCCN(C)C(=O)Oc1cc(C(C)N(C)C)c2c(c1)oc(=O)c1ccccc21