Reaction Details
TargetMelanocortin receptor 4
LigandBDBM135753
Substrate/Competitorn/a
Meas. Tech.Competitive Inhibition Assay Using [I125]-NDP-a-MSH
pH7.5±n/a
Temperature310.15±n/a K
Ki 0.8±n/a nM
Commentsextracted
Citation Shi, YSharma, SDDodd, JHYang, W Melanocortin receptor-specific heptapeptides US Patent US9458201 Publication Date 10/4/2016
 
Melanocortin receptor 4
Name:Melanocortin receptor 4
Type:Enzyme
Mol. Mass.:36949.50
Organism:Homo sapiens (Human)
Description:P32245
Residue:332
BDBM135753
NameBDBM135753
Synonyms:US10179804, Example 138 US8846601, 138 | US9458201, 138
TypeSmall organic molecule
Emp. Form.C53H79N17O9
Mol. Mass.1098.3029
SMILESNCC[C@@H]1NC(=O)[C@H](CC(=O)NCCCC[C@H](NC(=O)[C@H](Cc2c[nH]c3ccccc23)NC(=O)[C@H](CCCNC(N)=N)NC(=O)[C@@H](Cc2ccccc2)NC1=O)C(N)=O)NC(=O)[C@H](CCCNC(N)=N)NC(=O)CC1CCCC1