Reaction Details
TargetSodium channel protein type 9 subunit alpha
LigandBDBM254106
Substrate/Competitorn/a
Meas. Tech.Electrophysiological Assay (In vitro Assay)
IC50 23.2±n/a nM
Citation Liu, SFocken, TChahal, NZhang, ZOballa, RMFonarev, J Biaryl ether sulfonamides and their use as therapeutic agents US Patent US9481677 Publication Date 11/1/2016
 
Sodium channel protein type 9 subunit alpha
Name:Sodium channel protein type 9 subunit alpha
Type:Protein
Mol. Mass.:226375.97
Organism:Homo sapiens (Human)
Description:Q15858
Residue:1988
BDBM254106
NameBDBM254106
Synonyms:US9481677, 34.24
TypeSmall organic molecule
Emp. Form.C24H14ClF3N4O3S
Mol. Mass.530.906
SMILESFc1cccnc1NS(=O)(=O)c1cc(F)c(Oc2ccc(Cl)cc2-c2cccc3nccn23)cc1F