Reaction Details
TargetSodium channel protein type 9 subunit alpha
LigandBDBM254112
Substrate/Competitorn/a
Meas. Tech.Electrophysiological Assay (In vitro Assay)
IC50 17.4±n/a nM
Citation Liu, SFocken, TChahal, NZhang, ZOballa, RMFonarev, J Biaryl ether sulfonamides and their use as therapeutic agents US Patent US9481677 Publication Date 11/1/2016
 
Sodium channel protein type 9 subunit alpha
Name:Sodium channel protein type 9 subunit alpha
Type:Protein
Mol. Mass.:226375.97
Organism:Homo sapiens (Human)
Description:Q15858
Residue:1988
BDBM254112
NameBDBM254112
Synonyms:US9481677, 46
TypeSmall organic molecule
Emp. Form.C22H13ClF2N6O4S2
Mol. Mass.562.956
SMILESNC(=O)c1cnc2ccc(cn12)-c1cc(Cl)ccc1Oc1cc(F)c(cc1F)S(=O)(=O)Nc1ncns1