Reaction Details
TargetSodium channel protein type 9 subunit alpha
LigandBDBM50169432
Substrate/Competitorn/a
Meas. Tech.Electrophysiological Assay (In vitro Assay)
IC50 1.7±n/a nM
Citation Liu, SFocken, TChahal, NZhang, ZOballa, RMFonarev, J Biaryl ether sulfonamides and their use as therapeutic agents US Patent US9481677 Publication Date 11/1/2016
 
Sodium channel protein type 9 subunit alpha
Name:Sodium channel protein type 9 subunit alpha
Type:Protein
Mol. Mass.:226375.97
Organism:Homo sapiens (Human)
Description:Q15858
Residue:1988
BDBM50169432
NameBDBM50169432
Synonyms:CHEMBL3805973 | US9481677, 48
TypeSmall organic molecule
Emp. Form.C21H12ClF2N5O4S2
Mol. Mass.535.931
SMILESFc1cc(c(F)cc1Oc1ccc(Cl)cc1-c1ccc2[nH]c(=O)[nH]c2c1)S(=O)(=O)Nc1ncns1