Reaction Details
TargetSodium channel protein type 9 subunit alpha
LigandBDBM254115
Substrate/Competitorn/a
Meas. Tech.Electrophysiological Assay (In vitro Assay)
IC50 17.9±n/a nM
Citation Liu, SFocken, TChahal, NZhang, ZOballa, RMFonarev, J Biaryl ether sulfonamides and their use as therapeutic agents US Patent US9481677 Publication Date 11/1/2016
 
Sodium channel protein type 9 subunit alpha
Name:Sodium channel protein type 9 subunit alpha
Type:Protein
Mol. Mass.:226375.97
Organism:Homo sapiens (Human)
Description:Q15858
Residue:1988
BDBM254115
NameBDBM254115
Synonyms:US9481677, 53
TypeSmall organic molecule
Emp. Form.C21H11ClF2N4O5S2
Mol. Mass.536.916
SMILESFc1cc(c(F)cc1Oc1ccc(Cl)cc1-c1ccc2[nH]c(=O)oc2c1)S(=O)(=O)Nc1ncns1