Reaction Details
TargetSodium channel protein type 9 subunit alpha
LigandBDBM50169433
Substrate/Competitorn/a
Meas. Tech.Electrophysiological Assay (In vitro Assay)
IC50 3±n/a nM
Citation Liu, SFocken, TChahal, NZhang, ZOballa, RMFonarev, J Biaryl ether sulfonamides and their use as therapeutic agents US Patent US9481677 Publication Date 11/1/2016
 
Sodium channel protein type 9 subunit alpha
Name:Sodium channel protein type 9 subunit alpha
Type:Protein
Mol. Mass.:226375.97
Organism:Homo sapiens (Human)
Description:Q15858
Residue:1988
BDBM50169433
NameBDBM50169433
Synonyms:CHEMBL3805201 | US9481677, 58
TypeSmall organic molecule
Emp. Form.C21H13F2N5O4S2
Mol. Mass.501.486
SMILESNc1noc2ccc(cc12)-c1ccccc1Oc1cc(F)c(cc1F)S(=O)(=O)Nc1ncns1