Reaction Details
TargetSodium channel protein type 9 subunit alpha
LigandBDBM50169430
Substrate/Competitorn/a
Meas. Tech.Electrophysiological Assay (In vitro Assay)
IC50 3.6±n/a nM
Citation Liu, SFocken, TChahal, NZhang, ZOballa, RMFonarev, J Biaryl ether sulfonamides and their use as therapeutic agents US Patent US9481677 Publication Date 11/1/2016
 
Sodium channel protein type 9 subunit alpha
Name:Sodium channel protein type 9 subunit alpha
Type:Protein
Mol. Mass.:226375.97
Organism:Homo sapiens (Human)
Description:Q15858
Residue:1988
BDBM50169430
NameBDBM50169430
Synonyms:CHEMBL3805347 | US9481677, 59
TypeSmall organic molecule
Emp. Form.C22H12ClF2N5O3S2
Mol. Mass.531.942
SMILESFc1cc(c(F)cc1Oc1ccc(Cl)cc1-c1ccc2nccnc2c1)S(=O)(=O)Nc1ncns1