Reaction Details
TargetSodium channel protein type 9 subunit alpha
LigandBDBM50169434
Substrate/Competitorn/a
Meas. Tech.Electrophysiological Assay (In vitro Assay)
IC50 1.7±n/a nM
Citation Liu, SFocken, TChahal, NZhang, ZOballa, RMFonarev, J Biaryl ether sulfonamides and their use as therapeutic agents US Patent US9481677 Publication Date 11/1/2016
 
Sodium channel protein type 9 subunit alpha
Name:Sodium channel protein type 9 subunit alpha
Type:Protein
Mol. Mass.:226375.97
Organism:Homo sapiens (Human)
Description:Q15858
Residue:1988
BDBM50169434
NameBDBM50169434
Synonyms:CHEMBL3805837 | US9481677, 80
TypeSmall organic molecule
Emp. Form.C21H12F3N5O4S2
Mol. Mass.519.476
SMILESNc1noc2ccc(cc12)-c1cc(F)ccc1Oc1cc(F)c(cc1F)S(=O)(=O)Nc1ncns1