Reaction Details
TargetSodium channel protein type 9 subunit alpha
LigandBDBM254125
Substrate/Competitorn/a
Meas. Tech.Electrophysiological Assay (In vitro Assay)
IC50 0.7±n/a nM
Citation Liu, SFocken, TChahal, NZhang, ZOballa, RMFonarev, J Biaryl ether sulfonamides and their use as therapeutic agents US Patent US9481677 Publication Date 11/1/2016
 
Sodium channel protein type 9 subunit alpha
Name:Sodium channel protein type 9 subunit alpha
Type:Protein
Mol. Mass.:226375.97
Organism:Homo sapiens (Human)
Description:Q15858
Residue:1988
BDBM254125
NameBDBM254125
Synonyms:US9481677, 82
TypeSmall organic molecule
Emp. Form.C22H14F2N4O5S2
Mol. Mass.516.497
SMILESCc1ccc(Oc2cc(F)c(cc2F)S(=O)(=O)Nc2ncns2)c(c1)-c1ccc2oc(=O)[nH]c2c1