Reaction Details
TargetCholesteryl ester transfer protein
LigandBDBM254037
Substrate/Competitorn/a
Meas. Tech.Cholesteryl Ester Transfer Assay
IC50 5.3±n/a nM
Citation Lee, JKOh, JTLee, JWLee, SHKim, ILee, JYBae, SYLee, SRKim, YT Biaryl- or heterocyclic biaryl-substituted cyclohexene derivative compounds as CETP inhibitors US Patent US9493430 Publication Date 11/15/2016
 
Cholesteryl ester transfer protein
Name:Cholesteryl ester transfer protein
Type:Enzyme
Mol. Mass.:54751.53
Organism:Homo sapiens (Human)
Description:P11597
Residue:493
BDBM254037
NameBDBM254037
Synonyms:US9493430, 584
TypeSmall organic molecule
Emp. Form.C34H31ClF6N2O5
Mol. Mass.697.064
SMILESCOc1ncc(cc1C1=C(CN2[C@@H](C)[C@H](OC2=O)c2cc(cc(c2)C(F)(F)F)C(F)(F)F)CC(C)(C)CC1)-c1ccc(cc1Cl)C(O)=O