Reaction Details
TargetCholesteryl ester transfer protein
LigandBDBM254047
Substrate/Competitorn/a
Meas. Tech.Cholesteryl Ester Transfer Assay
IC50 7.6±n/a nM
Citation Lee, JKOh, JTLee, JWLee, SHKim, ILee, JYBae, SYLee, SRKim, YT Biaryl- or heterocyclic biaryl-substituted cyclohexene derivative compounds as CETP inhibitors US Patent US9493430 Publication Date 11/15/2016
 
Cholesteryl ester transfer protein
Name:Cholesteryl ester transfer protein
Type:Enzyme
Mol. Mass.:54751.53
Organism:Homo sapiens (Human)
Description:P11597
Residue:493
BDBM254047
NameBDBM254047
Synonyms:US9493430, 616
TypeSmall organic molecule
Emp. Form.C37H34F9NO5
Mol. Mass.743.6552
SMILESCOc1cc(c(cc1C1=C(CN2[C@@H](C)[C@H](OC2=O)c2cc(cc(c2)C(F)(F)F)C(F)(F)F)CC(C)(C)CC1)-c1ccc(cc1C)C(O)=O)C(F)(F)F