Reaction Details
TargetCholesteryl ester transfer protein
LigandBDBM254054
Substrate/Competitorn/a
Meas. Tech.Cholesteryl Ester Transfer Assay
IC50 2.5±n/a nM
Citation Lee, JKOh, JTLee, JWLee, SHKim, ILee, JYBae, SYLee, SRKim, YT Biaryl- or heterocyclic biaryl-substituted cyclohexene derivative compounds as CETP inhibitors US Patent US9493430 Publication Date 11/15/2016
 
Cholesteryl ester transfer protein
Name:Cholesteryl ester transfer protein
Type:Enzyme
Mol. Mass.:54751.53
Organism:Homo sapiens (Human)
Description:P11597
Residue:493
BDBM254054
NameBDBM254054
Synonyms:US9493430, 661
TypeSmall organic molecule
Emp. Form.C35H31F8NO5
Mol. Mass.697.6116
SMILESCOc1cc(F)c(cc1C1=C(CN2[C@@H](C)[C@H](OC2=O)c2cc(cc(c2)C(F)(F)F)C(F)(F)F)CC(C)(C)CC1)-c1ccc(cc1F)C(O)=O