Reaction Details
TargetCholesteryl ester transfer protein
LigandBDBM254060
Substrate/Competitorn/a
Meas. Tech.Cholesteryl Ester Transfer Assay
IC50 6.4±n/a nM
Citation Lee, JKOh, JTLee, JWLee, SHKim, ILee, JYBae, SYLee, SRKim, YT Biaryl- or heterocyclic biaryl-substituted cyclohexene derivative compounds as CETP inhibitors US Patent US9493430 Publication Date 11/15/2016
 
Cholesteryl ester transfer protein
Name:Cholesteryl ester transfer protein
Type:Enzyme
Mol. Mass.:54751.53
Organism:Homo sapiens (Human)
Description:P11597
Residue:493
BDBM254060
NameBDBM254060
Synonyms:US9493430, 695
TypeSmall organic molecule
Emp. Form.C35H29F10NO4
Mol. Mass.717.5931
SMILESC[C@H]1[C@H](OC(=O)N1CC1=C(CCC(C)(C)C1)c1cc(ccc1F)-c1ccc(cc1C(F)(F)F)C(O)=O)c1cc(cc(c1)C(F)(F)F)C(F)(F)F