Reaction Details
TargetCholesteryl ester transfer protein
LigandBDBM254063
Substrate/Competitorn/a
Meas. Tech.Cholesteryl Ester Transfer Assay
IC50 7.5±n/a nM
Citation Lee, JKOh, JTLee, JWLee, SHKim, ILee, JYBae, SYLee, SRKim, YT Biaryl- or heterocyclic biaryl-substituted cyclohexene derivative compounds as CETP inhibitors US Patent US9493430 Publication Date 11/15/2016
 
Cholesteryl ester transfer protein
Name:Cholesteryl ester transfer protein
Type:Enzyme
Mol. Mass.:54751.53
Organism:Homo sapiens (Human)
Description:P11597
Residue:493
BDBM254063
NameBDBM254063
Synonyms:US9493430, 729
TypeSmall organic molecule
Emp. Form.C35H29ClF9NO4
Mol. Mass.734.048
SMILESC[C@H]1[C@H](OC(=O)N1CC1=C(CCC(C)(C)C1)c1cc(ccc1Cl)-c1ccc(cc1C(F)(F)F)C(O)=O)c1cc(cc(c1)C(F)(F)F)C(F)(F)F