Reaction Details
TargetMembrane primary amine oxidase
LigandBDBM103941
Substrate/Competitorn/a
Meas. Tech.Biological Assay
pH7.4±n/a
IC50 48±0.0 nM
Commentsextracted
Citation Savory, EHigginbottom, MOliver, KHorgan, VA 4,5,6,7-tetrahyroimidazo[4,5-c]pyridine compounds US Patent US9493457 Publication Date 11/15/2016
 
Membrane primary amine oxidase
Name:Membrane primary amine oxidase
Type:Protein
Mol. Mass.:84620.86
Organism:Homo sapiens (Human)
Description:Q16853
Residue:763
BDBM103941
NameBDBM103941
Synonyms:US10399973, Example 14 US9035066, 14 US9890160, Example 14
TypeSmall organic molecule
Emp. Form.C18H23N3O3
Mol. Mass.329.3935
SMILESCC(C)C1N(CCc2nc[nH]c12)C(=O)OCCOc1ccccc1