Reaction Details
TargetGlutathione S-transferase P/Lysine-specific histone demethylase 1A [158-852]
LigandBDBM254556
Substrate/Competitorn/a
Meas. Tech.Biological Assay
pH7.4±n/a
Temperature310.15±n/a K
Ki 50±n/a nM
Commentsextracted
Citation Ortega Muñoz, AFyfe, MCMartinell Pedemonte, MEstiarte Martínez, MValls Vidal, NKurz, GCastro Palomino Laria, JC (Hetero)aryl cyclopropylamine compounds as LSD1 inhibitors US Patent US9469597 Publication Date 10/18/2016
 
Glutathione S-transferase P/Lysine-specific histone demethylase 1A [158-852]
Name:Glutathione S-transferase P/Lysine-specific histone demethylase 1A [158-852]
Synonyms:GST-Lysine Specific Demethylase-1 (LSD1)
Type:Enzyme
Mol. Mass.:n/a
Description:n/a
Components:This complex has 2 components.
Component 1
Name:Glutathione S-transferase P
Type:Enzyme
Mol. Mass.:23353.53
Organism:Homo sapiens (Human)
Description:P09211
Residue:210
Component 2
Name:Lysine-specific histone demethylase 1A [158-852]
Synonyms:AOF2 KDM1A KIAA0601 Lysine Specific Demethylase-1 (LSD1)
Type:Enzyme
Mol. Mass.:77140.81
Organism:Homo sapiens (Human)
Description:aa 158-852
Residue:695
BDBM254556
NameBDBM254556
Synonyms:US10214477, Example 15 US9670136, 15 (R)-1-(4-(((trans)-2-phenylcyclopropyl)amino)cyclohexyl)pyrrolidin-3-amine trihydrochloride
TypeSmall organic molecule
Emp. Form.C19H29N3
Mol. Mass.299.4537
SMILESN[C@@H]1CCN(C1)C1CCC(CC1)N[C@H]1C[C@@H]1c1ccccc1