Reaction Details
TargetTyrosine-protein kinase BTK
LigandBDBM255257
Substrate/Competitorn/a
Meas. Tech.LANCE (Lanthanide Chelate Excite) TR-FRET (Time-resolved fluorescence resonance energy transfer) Assay
IC50 0.24±n/a nM
Citation Kim, RMLiu, JGao, XBoga, SBGuiadeen, DKozlowski, JAYu, WAnand, RYu, YSelyutin, OBGao, YWu, HLiu, SYang, CWang, H Substituted benzamides and substituted pyridinecarboxamides as Btk inhibitors US Patent US9481682 Publication Date 11/1/2016
 
Tyrosine-protein kinase BTK
Name:Tyrosine-protein kinase BTK
Type:Enzyme
Mol. Mass.:76289.95
Organism:Homo sapiens (Human)
Description:Q06187
Residue:659
BDBM255257
NameBDBM255257
Synonyms:US9481682, 5
TypeSmall organic molecule
Emp. Form.C29H29N7O3
Mol. Mass.523.5857
SMILESNc1nccn2c(nc(-c3ccc(cc3)C(=O)Nc3cc(OC4CC4)ccn3)c12)[C@@H]1CC[C@H]2CCC(=O)N2C1