Reaction Details
TargetTyrosine-protein kinase BTK
LigandBDBM255331
Substrate/Competitorn/a
Meas. Tech.LANCE (Lanthanide Chelate Excite) TR-FRET (Time-resolved fluorescence resonance energy transfer) Assay
IC50 0.27±n/a nM
Citation Kim, RMLiu, JGao, XBoga, SBGuiadeen, DKozlowski, JAYu, WAnand, RYu, YSelyutin, OBGao, YWu, HLiu, SYang, CWang, H Substituted benzamides and substituted pyridinecarboxamides as Btk inhibitors US Patent US9481682 Publication Date 11/1/2016
 
Tyrosine-protein kinase BTK
Name:Tyrosine-protein kinase BTK
Type:Enzyme
Mol. Mass.:76289.95
Organism:Homo sapiens (Human)
Description:Q06187
Residue:659
BDBM255331
NameBDBM255331
Synonyms:US9481682, 80
TypeSmall organic molecule
Emp. Form.C29H29F3N8O2
Mol. Mass.578.5882
SMILESCCN1C[C@@H]2CC[C@H](CN2C(=O)C1)c1nc(-c2ccc(cc2)C(=O)Nc2cc(ccn2)C(F)(F)F)c2c(N)nccn12