Reaction Details
TargetTyrosine-protein kinase Lck
LigandBDBM255476
Substrate/Competitorn/a
Meas. Tech.Enzyme Binding Assays (Kinomescan)
Kd 4.2±0.0 nM
Citation Fyfe, MC Kinase inhibitor US Patent US9499486 Publication Date 11/22/2016
 
Tyrosine-protein kinase Lck
Name:Tyrosine-protein kinase Lck
Type:n/a
Mol. Mass.:57987.83
Organism:Homo sapiens (Human)
Description:P06239
Residue:509
BDBM255476
NameBDBM255476
Synonyms:US10125100, Example 1 US10941115, Example 1 US9751837, Example 1
TypeSmall organic molecule
Emp. Form.C36H37N5O8S
Mol. Mass.699.773
SMILESCOc1cc(Nc2cc(Oc3ccc(NC(=O)Nc4cc(cc(NS(C)(=O)=O)c4OC)C(C)(C)C)c4ccccc34)ccn2)ccc1C(O)=O