Reaction Details
Targetchymase
LigandBDBM255962
Substrate/Competitorn/a
Meas. Tech.Enzymatic Chymase Assay
pH7.5±n/a
IC50 1±n/a nM
Commentsextracted
Citation Fürstner, CAckerstaff, JStraub, AMeier, HTinel, HZimmermann, KTersteegen, AZubov, DKast, RSchamberger, JSchäfer, MBörngen, K Bicyclically substituted uracils and the use thereof US Patent US9481672 Publication Date 11/1/2016
 
chymase
Name:chymase
Synonyms:n/a
Type:Enzyme
Mol. Mass.:27507.42
Organism:Mesocricetus auratus (Golden hamster)
Description:A0A1U7QTH6
Residue:247
BDBM255962
NameBDBM255962
Synonyms:US9481672, 140
TypeSmall organic molecule
Emp. Form.C23H18ClF3N4O5
Mol. Mass.522.861
SMILESCCn1c2cc(ccc2n(C)c1=O)-n1cc(C(O)=O)c(=O)n(Cc2cccc(c2Cl)C(F)(F)F)c1=O