Reaction Details
Targetchymase
LigandBDBM255964
Substrate/Competitorn/a
Meas. Tech.Enzymatic Chymase Assay
pH7.5±n/a
IC50 1±n/a nM
Commentsextracted
Citation Fürstner, CAckerstaff, JStraub, AMeier, HTinel, HZimmermann, KTersteegen, AZubov, DKast, RSchamberger, JSchäfer, MBörngen, K Bicyclically substituted uracils and the use thereof US Patent US9481672 Publication Date 11/1/2016
 
chymase
Name:chymase
Synonyms:n/a
Type:Enzyme
Mol. Mass.:27507.42
Organism:Mesocricetus auratus (Golden hamster)
Description:A0A1U7QTH6
Residue:247
BDBM255964
NameBDBM255964
Synonyms:US9481672, 142
TypeSmall organic molecule
Emp. Form.C23H15ClF6N4O5
Mol. Mass.576.832
SMILESCn1c2ccc(cc2n(CC(F)(F)F)c1=O)-n1cc(C(O)=O)c(=O)n(Cc2cccc(Cl)c2C(F)(F)F)c1=O