Reaction Details
Targetchymase
LigandBDBM255968
Substrate/Competitorn/a
Meas. Tech.Enzymatic Chymase Assay
pH7.5±n/a
IC50 1±n/a nM
Commentsextracted
Citation Fürstner, CAckerstaff, JStraub, AMeier, HTinel, HZimmermann, KTersteegen, AZubov, DKast, RSchamberger, JSchäfer, MBörngen, K Bicyclically substituted uracils and the use thereof US Patent US9481672 Publication Date 11/1/2016
 
chymase
Name:chymase
Synonyms:n/a
Type:Enzyme
Mol. Mass.:27507.42
Organism:Mesocricetus auratus (Golden hamster)
Description:A0A1U7QTH6
Residue:247
BDBM255968
NameBDBM255968
Synonyms:US9481672, 146
TypeSmall organic molecule
Emp. Form.C26H23F3N4O5
Mol. Mass.528.4798
SMILESCc1c(Cn2c(=O)c(cn(-c3ccc4n(C)c(=O)n(CC5CC5)c4c3)c2=O)C(O)=O)cccc1C(F)(F)F