Reaction Details
Targetchymase
LigandBDBM256088
Substrate/Competitorn/a
Meas. Tech.Enzymatic Chymase Assay
pH7.5±n/a
IC50 2±n/a nM
Commentsextracted
Citation Fürstner, CAckerstaff, JStraub, AMeier, HTinel, HZimmermann, KTersteegen, AZubov, DKast, RSchamberger, JSchäfer, MBörngen, K Bicyclically substituted uracils and the use thereof US Patent US9481672 Publication Date 11/1/2016
 
chymase
Name:chymase
Synonyms:n/a
Type:Enzyme
Mol. Mass.:27507.42
Organism:Mesocricetus auratus (Golden hamster)
Description:A0A1U7QTH6
Residue:247
BDBM256088
NameBDBM256088
TypeSmall organic molecule
Emp. Form.C24H21ClN4O5
Mol. Mass.480.9
SMILESCn1c2ccc(cc2n(C)c1=O)-n1cc(C(O)=O)c(=O)n(C2CCCc3c(Cl)cccc23)c1=O