Reaction Details
TargetAmine oxidase [flavin-containing] A
LigandBDBM256482
Substrate/Competitorn/a
Meas. Tech.Biological Assay
pH7.5±n/a
Temperature310.15±n/a K
IC50 3580±n/a nM
Commentsextracted
Citation Ortega Muñoz, AFyfe, MCMartinell Pedemonte, MEstiarte Martinez, MValls Vidal, NKurz, GCastro Palomino Laria, JC (Hetero)aryl cyclopropylamine compounds as LSD1 inhibitors US Patent US9487512 Publication Date 11/8/2016
 
Amine oxidase [flavin-containing] A
Name:Amine oxidase [flavin-containing] A
Type:Protein
Mol. Mass.:59689.53
Organism:Homo sapiens (Human)
Description:P21397
Residue:527
BDBM256482
NameBDBM256482
Synonyms:US10329256, Example 27 US9944601, Example 27
TypeSmall organic molecule
Emp. Form.C22H27FN2O
Mol. Mass.354.461
SMILESFc1ccccc1COc1ccc(cc1)[C@H]1C[C@@H]1NCC1CCNCC1