Reaction Details
TargetGlutathione S-transferase P/Isoform 2 of Lysine-specific histone demethylase 1A (2) [158-876]
LigandBDBM256484
Substrate/Competitorn/a
Meas. Tech.Biological Assay
pH7.4±n/a
Temperature310.15±n/a K
IC50 23±n/a nM
Commentsextracted
Citation Ortega Muñoz, AFyfe, MCMartinell Pedemonte, MEstiarte Martinez, MValls Vidal, NKurz, GCastro Palomino Laria, JC (Hetero)aryl cyclopropylamine compounds as LSD1 inhibitors US Patent US9487512 Publication Date 11/8/2016
 
Glutathione S-transferase P/Isoform 2 of Lysine-specific histone demethylase 1A (2) [158-876]
Name:Glutathione S-transferase P/Isoform 2 of Lysine-specific histone demethylase 1A (2) [158-876]
Type:Enzyme
Mol. Mass.:n/a
Description:n/a
Components:This complex has 2 components.
Component 1
Name:Glutathione S-transferase P
Synonyms:FAEES3 GST3 GSTP1-1 Glutathione S-transferase Glutathione S-transferase P Glutathione transferase (GST)
Type:Enzyme
Mol. Mass.:23353.53
Organism:Homo sapiens (Human)
Description:P09211
Residue:210
Component 2
Name:Isoform 2 of Lysine-specific histone demethylase 1A (2) [158-876]
Synonyms:AOF2 KDM1A KIAA0601 Lysine-specific histone demethylase 1A (2) [158-876] | Lysine-specific histone demethylase 1A (LSD1)
Type:n/a
Mol. Mass.:79390.01
Organism:Homo sapiens (Human)
Description:amino acids 158-end; GenBank accession no. NM_015013, uniprot: O60341-2 from NM_015013
Residue:719
BDBM256484
NameBDBM256484
Synonyms:US10329256, Example 29 US9944601, Example 29
TypeSmall organic molecule
Emp. Form.C22H29N3O3S
Mol. Mass.415.549
SMILESCOc1ccc(NS(C)(=O)=O)cc1-c1ccc(cc1)[C@H]1C[C@@H]1NC1CCNCC1