Reaction Details
TargetGlutathione S-transferase P/Lysine-specific histone demethylase 1A [172-833]
LigandBDBM256637
Substrate/Competitorn/a
Meas. Tech.Inhibitory Activity Assay
pH8±n/a
Temperature298.15±n/a K
IC50<100±n/a nM
Commentsextracted
Citation Matsumoto, SHattori, YToyofuku, MMorimoto, SDaini, MKojima, TKaku, TIto, M Cyclopropanamine compound and use thereof US Patent US9487511 Publication Date 11/8/2016
 
Glutathione S-transferase P/Lysine-specific histone demethylase 1A [172-833]
Name:Glutathione S-transferase P/Lysine-specific histone demethylase 1A [172-833]
Synonyms:GST-Lysine-specific histone demethylase 1A (LSD1)
Type:Enzyme
Mol. Mass.:n/a
Description:n/a
Components:This complex has 2 components.
Component 1
Name:Glutathione S-transferase P
Type:Enzyme
Mol. Mass.:23353.53
Organism:Homo sapiens (Human)
Description:P09211
Residue:210
Component 2
Name:Lysine-specific histone demethylase 1A [172-833]
Synonyms:AOF2 KDM1A KIAA0601 Lysine-specific histone demethylase 1A (LSD1)
Type:Enzyme
Mol. Mass.:73571.08
Organism:Homo sapiens (Human)
Description:aa 172-833
Residue:662
BDBM256637
NameBDBM256637
Synonyms:US10053456, 16 US10968213, Example 16 US9718814, 16 | US9920047, 16
TypeSmall organic molecule
Emp. Form.C23H26N4O2S
Mol. Mass.422.543
SMILESCc1nnc(NC(=O)c2cc(cc3ccccc23)C2CC2NCC2CCOCC2)s1