Reaction Details
TargetGlutathione S-transferase P/Lysine-specific histone demethylase 1A [172-833]
LigandBDBM256653
Substrate/Competitorn/a
Meas. Tech.Inhibitory Activity Assay
pH8±n/a
Temperature298.15±n/a K
IC50<100±n/a nM
Commentsextracted
Citation Matsumoto, SHattori, YToyofuku, MMorimoto, SDaini, MKojima, TKaku, TIto, M Cyclopropanamine compound and use thereof US Patent US9487511 Publication Date 11/8/2016
 
Glutathione S-transferase P/Lysine-specific histone demethylase 1A [172-833]
Name:Glutathione S-transferase P/Lysine-specific histone demethylase 1A [172-833]
Synonyms:GST-Lysine-specific histone demethylase 1A (LSD1)
Type:Enzyme
Mol. Mass.:n/a
Description:n/a
Components:This complex has 2 components.
Component 1
Name:Glutathione S-transferase P
Type:Enzyme
Mol. Mass.:23353.53
Organism:Homo sapiens (Human)
Description:P09211
Residue:210
Component 2
Name:Lysine-specific histone demethylase 1A [172-833]
Synonyms:AOF2 KDM1A KIAA0601 Lysine-specific histone demethylase 1A (LSD1)
Type:Enzyme
Mol. Mass.:73571.08
Organism:Homo sapiens (Human)
Description:aa 172-833
Residue:662
BDBM256653
NameBDBM256653
Synonyms:US10053456, 32 US10968213, Example 32 US9718814, 32 | US9920047, 32
TypeSmall organic molecule
Emp. Form.C17H24N2O2S
Mol. Mass.320.45
SMILESO=C(NC1CCOCC1)c1csc(c1)C1CC1NCC1CC1